Reaction Details
TargetRibosomal protein S6 kinase alpha-3
LigandBDBM50381995
Substrate/Competitorn/a
Meas. Tech.ChEMBL_815116 (CHEMBL2024841)
IC50 7700±n/a nM
Citation Voss, MERainka, MPFleming, MPeterson, LHBelanger, DBSiddiqui, MAHruza, AVoigt, JGray, KBasso, AD Synthesis and SAR studies of imidazo-[1,2-a]-pyrazine Aurora kinase inhibitors with improved off-target kinase selectivity. Bioorg Med Chem Lett22:3544-9 (2012) 
 
Ribosomal protein S6 kinase alpha-3
Name:Ribosomal protein S6 kinase alpha-3
Type:Serine/threonine-protein kinase
Mol. Mass.:83740.03
Organism:Homo sapiens (Human)
Description:The human RSK2 sequence differed from the Genbank entry NM_004586 at one residue, V45G. The protein was cloned and purified from baculovirus expression system.
Residue:740
BDBM50381995
NameBDBM50381995
Synonyms:CHEMBL2022369
TypeSmall organic molecule
Emp. Form.C27H31N9OS2
Mol. Mass.561.725
SMILESCC1CCCN(Cc2cc(Nc3nc(C)cn4c(cnc34)-c3cnn(CC(=O)NCc4cccs4)c3)sn2)C1