Reaction Details
TargetTyrosine-protein kinase Lck
LigandBDBM50381997
Substrate/Competitorn/a
Meas. Tech.ChEMBL_815113 (CHEMBL2024838)
IC50 731±n/a nM
Citation Voss, MERainka, MPFleming, MPeterson, LHBelanger, DBSiddiqui, MAHruza, AVoigt, JGray, KBasso, AD Synthesis and SAR studies of imidazo-[1,2-a]-pyrazine Aurora kinase inhibitors with improved off-target kinase selectivity. Bioorg Med Chem Lett22:3544-9 (2012) 
 
Tyrosine-protein kinase Lck
Name:Tyrosine-protein kinase Lck
Type:n/a
Mol. Mass.:57987.83
Organism:Homo sapiens (Human)
Description:P06239
Residue:509
BDBM50381997
NameBDBM50381997
Synonyms:CHEMBL2022379
TypeSmall organic molecule
Emp. Form.C27H30N10OS
Mol. Mass.542.659
SMILESCC1CCCN(Cc2cc(Nc3nc(C)cn4c(cnc34)-c3cnn(CC(=O)Nc4ccncc4)c3)sn2)C1