Reaction Details
TargetInterleukin-1 receptor-associated kinase 4
LigandBDBM50381995
Substrate/Competitorn/a
Meas. Tech.ChEMBL_815115 (CHEMBL2024840)
IC50 873±n/a nM
Citation Voss, MERainka, MPFleming, MPeterson, LHBelanger, DBSiddiqui, MAHruza, AVoigt, JGray, KBasso, AD Synthesis and SAR studies of imidazo-[1,2-a]-pyrazine Aurora kinase inhibitors with improved off-target kinase selectivity. Bioorg Med Chem Lett22:3544-9 (2012) 
 
Interleukin-1 receptor-associated kinase 4
Name:Interleukin-1 receptor-associated kinase 4
Type:Protein
Mol. Mass.:51519.08
Organism:Homo sapiens (Human)
Description:Q9NWZ3
Residue:460
BDBM50381995
NameBDBM50381995
Synonyms:CHEMBL2022369
TypeSmall organic molecule
Emp. Form.C27H31N9OS2
Mol. Mass.561.725
SMILESCC1CCCN(Cc2cc(Nc3nc(C)cn4c(cnc34)-c3cnn(CC(=O)NCc4cccs4)c3)sn2)C1