Reaction Details
TargetAurora kinase A
LigandBDBM50381996
Substrate/Competitorn/a
Meas. Tech.ChEMBL_815109 (CHEMBL2024834)
IC50 122±n/a nM
Citation Voss, MERainka, MPFleming, MPeterson, LHBelanger, DBSiddiqui, MAHruza, AVoigt, JGray, KBasso, AD Synthesis and SAR studies of imidazo-[1,2-a]-pyrazine Aurora kinase inhibitors with improved off-target kinase selectivity. Bioorg Med Chem Lett22:3544-9 (2012) 
 
Aurora kinase A
Name:Aurora kinase A
Type:Serine/threonine-protein kinase
Mol. Mass.:45830.98
Organism:Homo sapiens (Human)
Description:O14965
Residue:403
BDBM50381996
NameBDBM50381996
Synonyms:CHEMBL2022373
TypeSmall organic molecule
Emp. Form.C27H27F2N9OS
Mol. Mass.563.625
SMILESCc1cn2c(cnc2c(Nc2cc(CN3CCCCC3)ns2)n1)-c1cnn(CC(=O)Nc2cccc(F)c2F)c1