Reaction Details
TargetProstaglandin G/H synthase 2
LigandBDBM50337281
Substrate/Competitorn/a
Meas. Tech.ChEMBL_815553 (CHEMBL2025082)
IC50 740±n/a nM
Citation Chen, MAdeniji, AOTwenter, BMWinkler, JDChristianson, DWPenning, TM Crystal structures of AKR1C3 containing an N-(aryl)amino-benzoate inhibitor and a bifunctional AKR1C3 inhibitor and androgen receptor antagonist. Therapeutic leads for castrate resistant prostate cancer. Bioorg Med Chem Lett22:3492-7 (2012) 
 
Prostaglandin G/H synthase 2
Name:Prostaglandin G/H synthase 2
Type:Enzyme
Mol. Mass.:69003.89
Organism:Homo sapiens (Human)
Description:Recombinant Cox-2 provided by Cayman (Cayman Chemical Co.,Ann Arbor, MI).
Residue:604
BDBM50337281
NameBDBM50337281
Synonyms:3-[N-(4-nitrophenyl)amino]benzoic acid US9271961, 5
TypeSmall organic molecule
Emp. Form.C13H10N2O4
Mol. Mass.258.2295
SMILESOC(=O)c1cccc(Nc2ccc(cc2)[N+]([O-])=O)c1