Reaction Details
TargetSigma non-opioid intracellular receptor 1
LigandBDBM50382166
Substrate/Competitorn/a
Meas. Tech.ChEMBL_816069 (CHEMBL2026918)
IC50 0.27±n/a nM
Citation Riganas, SPapanastasiou, IFoscolos, GBTsotinis, ABourguignon, JJSerin, GMirjolet, JFDimas, KKourafalos, VNEleutheriades, AMoutsos, VIKhan, HGeorgakopoulou, SZaniou, APrassa, MTheodoropoulou, MPondiki, SVamvakides, A Synthesis,s1,s2-receptors binding affinity and antiproliferative action of new C1-substituted adamantanes. Bioorg Med Chem20:3323-31 (2012) 
 
Sigma non-opioid intracellular receptor 1
Name:Sigma non-opioid intracellular receptor 1
Type:Enzyme Catalytic Domain
Mol. Mass.:25124.85
Organism:Homo sapiens (Human)
Description:Q99720
Residue:223
BDBM50382166
NameBDBM50382166
Synonyms:CHEMBL2023825
TypeSmall organic molecule
Emp. Form.C33H44N2
Mol. Mass.468.7159
SMILESC1CCC(CC1)N1CCN(CC1)c1ccc(cc1)C(c1ccccc1)C12CC3CC(CC(C3)C1)C2