Reaction Details
Target5-hydroxytryptamine receptor 2A
LigandBDBM50382170
Substrate/Competitorn/a
Meas. Tech.ChEMBL_817251 (CHEMBL2025551)
Ki 153±n/a nM
Citation Hao, JChen, BYao, YHossain, MNagatomo, TYao, HKong, LSun, H Practical access to four stereoisomers of naftidrofuryl and their binding affinity towards 5-hydroxytryptamine 2A receptor. Bioorg Med Chem Lett22:3441-4 (2012) 
 
5-hydroxytryptamine receptor 2A
Name:5-hydroxytryptamine receptor 2A
Type:undefined
Mol. Mass.:52607.65
Organism:Homo sapiens (Human)
Description:P28223
Residue:471
BDBM50382170
NameBDBM50382170
Synonyms:CHEMBL2022154
TypeSmall organic molecule
Emp. Form.C24H33NO3
Mol. Mass.383.5237
SMILESCCN(CC)CCOC(=O)[C@H](C[C@@H]1CCCO1)Cc1cccc2ccccc12