Reaction Details
TargetProstaglandin G/H synthase 2
LigandBDBM50382183
Substrate/Competitorn/a
Meas. Tech.ChEMBL_817254 (CHEMBL2025554)
IC50 1370±n/a nM
Citation Smith, BChang, HHMedda, FGokhale, VDietrich, JDavis, AMeuillet, EJHulme, C Synthesis and biological activity of 2-aminothiazoles as novel inhibitors of PGE2 production in cells. Bioorg Med Chem Lett22:3567-70 (2012) 
 
Prostaglandin G/H synthase 2
Name:Prostaglandin G/H synthase 2
Type:Enzyme
Mol. Mass.:69003.89
Organism:Homo sapiens (Human)
Description:Recombinant Cox-2 provided by Cayman (Cayman Chemical Co.,Ann Arbor, MI).
Residue:604
BDBM50382183
NameBDBM50382183
Synonyms:CHEMBL1622194
TypeSmall organic molecule
Emp. Form.C17H16N2O2S
Mol. Mass.312.386
SMILESCOc1ccc(Nc2nc(cs2)-c2ccc(OC)cc2)cc1