Reaction Details
TargetProstaglandin G/H synthase 2
LigandBDBM50382185
Substrate/Competitorn/a
Meas. Tech.ChEMBL_817254 (CHEMBL2025554)
IC50>5000±n/a nM
Citation Smith, BChang, HHMedda, FGokhale, VDietrich, JDavis, AMeuillet, EJHulme, C Synthesis and biological activity of 2-aminothiazoles as novel inhibitors of PGE2 production in cells. Bioorg Med Chem Lett22:3567-70 (2012) 
 
Prostaglandin G/H synthase 2
Name:Prostaglandin G/H synthase 2
Type:Enzyme
Mol. Mass.:69003.89
Organism:Homo sapiens (Human)
Description:Recombinant Cox-2 provided by Cayman (Cayman Chemical Co.,Ann Arbor, MI).
Residue:604
BDBM50382185
NameBDBM50382185
Synonyms:CHEMBL1907447
TypeSmall organic molecule
Emp. Form.C22H18N2O2S
Mol. Mass.374.456
SMILESCOc1cccc(c1)-c1csc(Nc2ccc(Oc3ccccc3)cc2)n1