Reaction Details
TargetProstaglandin G/H synthase 1
LigandBDBM50174201
Substrate/Competitorn/a
Meas. Tech.ChEMBL_815719 (CHEMBL2025719)
IC50 220±n/a nM
Citation El-Sayed, MAAbdel-Aziz, NIAbdel-Aziz, AAEl-Azab, ASElTahir, KE Synthesis, biological evaluation and molecular modeling study of pyrazole and pyrazoline derivatives as selective COX-2 inhibitors and anti-inflammatory agents. Part 2. Bioorg Med Chem20:3306-16 (2012) 
 
Prostaglandin G/H synthase 1
Name:Prostaglandin G/H synthase 1
Type:Protein
Mol. Mass.:68868.60
Organism:Ovis aries (Sheep)
Description:n/a
Residue:600
BDBM50174201
NameBDBM50174201
Synonyms:ARTHROTEC SOLARAZE US11173137, Compound Diclofenac VOLTAREN-XR sodium 2-(2-(2,6-dichlorophenylamino)phenyl)acetate
TypeSmall organic molecule
Emp. Form.C14H10Cl2NO2
Mol. Mass.295.141
SMILES[O-]C(=O)Cc1ccccc1Nc1c(Cl)cccc1Cl