Reaction Details
TargetRho-associated protein kinase 2
LigandBDBM50382217
Substrate/Competitorn/a
Meas. Tech.ChEMBL_816456 (CHEMBL2024943)
Kd<0.200000±n/a nM
Citation Lavogina, DKalind, KBredihhina, JHurt, MVaasa, AKasari, MEnkvist, ERaidaru, GUri, A Conjugates of 5-isoquinolinesulfonylamides and oligo-D-arginine possess high affinity and selectivity towards Rho kinase (ROCK). Bioorg Med Chem Lett22:3425-30 (2012) 
 
Rho-associated protein kinase 2
Name:Rho-associated protein kinase 2
Type:Protein
Mol. Mass.:160885.43
Organism:Homo sapiens (Human)
Description:O75116
Residue:1388
BDBM50382217
NameBDBM50382217
Synonyms:CHEMBL2023845
TypeSmall organic molecule
Emp. Form.C84H130N32O14S
Mol. Mass.1844.202
SMILES[#6]-[#7](-[#6])-[#6]-1-[#6]=[#6]-[#6]-2=[#6](-c3ccc(cc3-[#8]-[#6]-2=[#6]-1)-[#7](-[#6])-[#6])-c1ccc(cc1-[#6](=O)-[#7]-[#6@H](-[#6]-[#6]-[#6]-[#6]-[#7])-[#6](=O)-[#7]-[#6](-[#7])=[#7]-[#6]-[#6]-[#6]-[#6@@H](-[#7]-[#6](=O)-[#6@@H](-[#6]-[#6]-[#6]\[#7]=[#6](\[#7])-[#7])-[#7]-[#6](=O)-[#6@@H](-[#6]-[#6]-[#6]\[#7]=[#6](\[#7])-[#7])-[#7]-[#6](=O)-[#6@@H](-[#6]-[#6]-[#6]\[#7]=[#6](\[#7])-[#7])-[#7]-[#6](=O)-[#6@@H](-[#6]-[#6]-[#6]\[#7]=[#6](\[#7])-[#7])-[#7]-[#6](=O)-[#6@@H](-[#6]-[#6]-[#6]\[#7]=[#6](\[#7])-[#7])-[#7]-[#6](=O)-[#6]-[#6]-[#6]-[#6]-[#6]-[#7]-[#6]-[#6]-[#7]S(=O)(=O)c1cccc2cnccc12)-[#6](-[#7])=O)-[#6](-[#8])=O