Reaction Details
TargetRho-associated protein kinase 2
LigandBDBM14027
Substrate/Competitorn/a
Meas. Tech.ChEMBL_816474 (CHEMBL2024961)
IC50 11749±n/a nM
Citation Lavogina, DKalind, KBredihhina, JHurt, MVaasa, AKasari, MEnkvist, ERaidaru, GUri, A Conjugates of 5-isoquinolinesulfonylamides and oligo-D-arginine possess high affinity and selectivity towards Rho kinase (ROCK). Bioorg Med Chem Lett22:3425-30 (2012) 
 
Rho-associated protein kinase 2
Name:Rho-associated protein kinase 2
Type:Protein
Mol. Mass.:160885.43
Organism:Homo sapiens (Human)
Description:O75116
Residue:1388
BDBM14027
NameBDBM14027
Synonyms:5-(1,4-diazepan-1-ylsulfonyl)isoquinoline AT877 CHEMBL541388 HA-1077 cid_163751
TypeSmall organic molecule
Emp. Form.C14H17N3O2S
Mol. Mass.291.369
SMILESO=S(=O)(N1CCCNCC1)c1cccc2cnccc12