Reaction Details
TargetRho-associated protein kinase 2
LigandBDBM15211
Substrate/Competitorn/a
Meas. Tech.ChEMBL_816474 (CHEMBL2024961)
Kd 24±n/a nM
Citation Lavogina, DKalind, KBredihhina, JHurt, MVaasa, AKasari, MEnkvist, ERaidaru, GUri, A Conjugates of 5-isoquinolinesulfonylamides and oligo-D-arginine possess high affinity and selectivity towards Rho kinase (ROCK). Bioorg Med Chem Lett22:3425-30 (2012) 
 
Rho-associated protein kinase 2
Name:Rho-associated protein kinase 2
Type:Protein
Mol. Mass.:160885.43
Organism:Homo sapiens (Human)
Description:O75116
Residue:1388
BDBM15211
NameBDBM15211
Synonyms:CHEMBL104264 H89 N-(2-{[(2E)-3-(4-bromophenyl)prop-2-en-1-yl]amino}ethyl)isoquinoline-5-sulfonamide | N-[2-[[(E)-3-(4-bromophenyl)prop-2-enyl]amino]ethyl]isoquinoline-5-sulfonamide
TypeSmall organic molecule
Emp. Form.C20H20BrN3O2S
Mol. Mass.446.361
SMILESBrc1ccc(\C=C\CNCCNS(=O)(=O)c2cccc3cnccc23)cc1