Reaction Details
TargetTransient receptor potential cation channel subfamily V member 1
LigandBDBM50382231
Substrate/Competitorn/a
Meas. Tech.ChEMBL_816251 (CHEMBL2026776)
IC50 33±n/a nM
Citation Urbahns, KYura, TGupta, JBTajimi, MFujishima, HMasuda, TYamamoto, NIkegami, YMarumo, MYasoshima, KYoshida, NMoriwaki, TMadge, DChan, FMogi, M Tetrahydro-naphthols as orally available TRPV1 inhibitors. Bioorg Med Chem Lett22:3408-11 (2012) 
 
Transient receptor potential cation channel subfamily V member 1
Name:Transient receptor potential cation channel subfamily V member 1
Type:Protein
Mol. Mass.:94960.75
Organism:Homo sapiens (Human)
Description:Q8NER1
Residue:839
BDBM50382231
NameBDBM50382231
Synonyms:CHEMBL2024659
TypeSmall organic molecule
Emp. Form.C16H11ClF3N3O
Mol. Mass.353.726
SMILESFC(F)(F)c1cc(NC(=O)Nc2cccc3[nH]ccc23)ccc1Cl