Reaction Details
TargetTransient receptor potential cation channel subfamily V member 1
LigandBDBM50382248
Substrate/Competitorn/a
Meas. Tech.ChEMBL_816251 (CHEMBL2026776)
IC50 30±n/a nM
Citation Urbahns, KYura, TGupta, JBTajimi, MFujishima, HMasuda, TYamamoto, NIkegami, YMarumo, MYasoshima, KYoshida, NMoriwaki, TMadge, DChan, FMogi, M Tetrahydro-naphthols as orally available TRPV1 inhibitors. Bioorg Med Chem Lett22:3408-11 (2012) 
 
Transient receptor potential cation channel subfamily V member 1
Name:Transient receptor potential cation channel subfamily V member 1
Type:Protein
Mol. Mass.:94960.75
Organism:Homo sapiens (Human)
Description:Q8NER1
Residue:839
BDBM50382248
NameBDBM50382248
Synonyms:CHEMBL2024498
TypeSmall organic molecule
Emp. Form.C19H15ClF3N3O
Mol. Mass.393.79
SMILESCNc1ccc2cccc(NC(=O)Nc3ccc(Cl)c(c3)C(F)(F)F)c2c1