Reaction Details
TargetTGF-beta receptor type-1
LigandBDBM50382317
Substrate/Competitorn/a
Meas. Tech.ChEMBL_815895 (CHEMBL2026330)
IC50 13±n/a nM
Citation Boys, MLBian, FKramer, JBChio, CLRen, XDChen, HBarrett, SDSexton, KEIula, DMFilzen, GFNguyen, MNAngell, PDowns, VLWang, ZRaheja, NEllsworth, ELFakhoury, SBratton, LDKeller, PRGowan, RDrummond, EMMaiti, SNHena, MALu, LMcConnell, PKnafels, JDThanabal, VSun, FAlessi, DMcCarthy, AZhang, EFinzel, BCPatel, SCiotti, SMEisma, RPayne, NAGilbertsen, RBKostlan, CRPocalyko, DJLala, DS Discovery of a series of 2-(1H-pyrazol-1-yl)pyridines as ALK5 inhibitors with potential utility in the prevention of dermal scarring. Bioorg Med Chem Lett22:3392-7 (2012) 
 
TGF-beta receptor type-1
Name:TGF-beta receptor type-1
Type:enzyme
Mol. Mass.:55968.24
Organism:Homo sapiens (Human)
Description:P36897
Residue:503
BDBM50382317
NameBDBM50382317
Synonyms:CHEMBL2024684
TypeSmall organic molecule
Emp. Form.C18H15N5O
Mol. Mass.317.3446
SMILESCc1cccc(n1)-n1nccc1-c1ccc2ncn(C)c(=O)c2c1