Reaction Details
TargetPeroxisome proliferator-activated receptor alpha
LigandBDBM50382327
Substrate/Competitorn/a
Meas. Tech.ChEMBL_817373 (CHEMBL2027596)
EC50 989±n/a nM
Citation Pérez-Fernández, RFresno, NMacías-González, MElguero, JDecara, JGirón, RRodríguez-Álvarez, AMartín, MIRodríguez de Fonseca, FGoya, P Discovery of Potent Dual PPARa Agonists/CB1 Ligands. ACS Med Chem Lett2:793-797 (2011) 
 
Peroxisome proliferator-activated receptor alpha
Name:Peroxisome proliferator-activated receptor alpha
Type:Enzyme
Mol. Mass.:52222.08
Organism:Homo sapiens (Human)
Description:Q07869
Residue:468
BDBM50382327
NameBDBM50382327
Synonyms:CHEMBL2022403
TypeSmall organic molecule
Emp. Form.C23H16Cl3N3O2
Mol. Mass.472.751
SMILESCc1c(nn(c1-c1ccc(Cl)cc1)-c1ccc(Cl)cc1Cl)C(=O)Nc1cccc(O)c1