Reaction Details
Target1,4-dihydroxy-2-naphthoyl-CoA synthase
LigandBDBM50382342
Substrate/Competitorn/a
Meas. Tech.ChEMBL_817595 (CHEMBL2027818)
IC50 8400±n/a nM
Citation Li, XLiu, NZhang, HKnudson, SELi, HJLai, CTSimmerling, CSlayden, RATonge, PJ CoA Adducts of 4-Oxo-4-Phenylbut-2-enoates: Inhibitors of MenB from the M. tuberculosis Menaquinone Biosynthesis Pathway. ACS Med Chem Lett2:818-823 (2011) 
 
1,4-dihydroxy-2-naphthoyl-CoA synthase
Name:1,4-dihydroxy-2-naphthoyl-CoA synthase
Type:PROTEIN
Mol. Mass.:34688.06
Organism:Mycobacterium tuberculosis
Description:ChEMBL_817596
Residue:314
BDBM50382342
NameBDBM50382342
Synonyms:CHEMBL2024256
TypeSmall organic molecule
Emp. Form.C18H18ClNO3
Mol. Mass.331.793
SMILESC[C@H](NC(CC(=O)c1ccccc1Cl)C(O)=O)c1ccccc1