Reaction Details
TargetTyrosine-protein kinase ITK/TSK
LigandBDBM15244
Substrate/Competitorn/a
Meas. Tech.ChEMBL_817836 (CHEMBL2027484)
IC50>10000±n/a nM
Citation Duffy, JPHarrington, EMSalituro, FGCochran, JEGreen, JGao, HBemis, GWEvindar, GGalullo, VPFord, PJGermann, UAWilson, KPBellon, SFChen, GTaslimi, PJones, PHuang, CPazhanisamy, SWang, YMMurcko, MASu, MS The Discovery of VX-745: A Novel and Selective p38a Kinase Inhibitor. ACS Med Chem Lett2:758-763 (2011) 
 
Tyrosine-protein kinase ITK/TSK
Name:Tyrosine-protein kinase ITK/TSK
Type:Protein
Mol. Mass.:71839.20
Organism:Homo sapiens (Human)
Description:Q08881
Residue:620
BDBM15244
NameBDBM15244
Synonyms:5-(2,6-dichlorophenyl)-2-(2,4-difluorophenyl)sulfanylpyrimido[1,6-b]pyridazin-6-one 5-(2,6-dichlorophenyl)-2-[(2,4-difluorophenyl)thio]-6-pyrimido[1,6-b]pyridazinone 5-(2,6-dichlorophenyl)-9-(2,4-difluorophenyl)sulfanyl-1,3,10-triazabicyclo[4.4.0]deca-2,5,7,9-tetraen-4-one VX-745 cid_3038525
TypeSmall organic molecule
Emp. Form.C19H9Cl2F2N3OS
Mol. Mass.436.262
SMILESFc1ccc(Sc2ccc3c(-c4c(Cl)cccc4Cl)c(=O)ncn3n2)c(F)c1