Reaction Details
TargetTyrosine-protein kinase receptor UFO
LigandBDBM50382414
Substrate/Competitorn/a
Meas. Tech.ChEMBL_815463 (CHEMBL2027231)
IC50 19±n/a nM
Citation Mollard, AWarner, SLCall, LTWade, MLBearss, JJVerma, ASharma, SVankayalapati, HBearss, DJ Design, Synthesis and Biological Evaluation of a Series of Novel Axl Kinase Inhibitors. ACS Med Chem Lett2:907-912 (2011) 
 
Tyrosine-protein kinase receptor UFO
Name:Tyrosine-protein kinase receptor UFO
Type:Enzyme
Mol. Mass.:98316.97
Organism:Homo sapiens (Human)
Description:P30530
Residue:894
BDBM50382414
NameBDBM50382414
Synonyms:CHEMBL2022975
TypeSmall organic molecule
Emp. Form.C26H32ClN7O2S
Mol. Mass.542.096
SMILESCN1CCN(Cc2ccc(Nc3ncc(Cl)c(Nc4ccccc4S(=O)(=O)N4CCCC4)n3)cc2)CC1