Reaction Details
TargetTyrosine-protein kinase receptor UFO
LigandBDBM50382444
Substrate/Competitorn/a
Meas. Tech.ChEMBL_815463 (CHEMBL2027231)
IC50 100±n/a nM
Citation Mollard, AWarner, SLCall, LTWade, MLBearss, JJVerma, ASharma, SVankayalapati, HBearss, DJ Design, Synthesis and Biological Evaluation of a Series of Novel Axl Kinase Inhibitors. ACS Med Chem Lett2:907-912 (2011) 
 
Tyrosine-protein kinase receptor UFO
Name:Tyrosine-protein kinase receptor UFO
Type:Enzyme
Mol. Mass.:98316.97
Organism:Homo sapiens (Human)
Description:P30530
Residue:894
BDBM50382444
NameBDBM50382444
Synonyms:CHEMBL2023352
TypeSmall organic molecule
Emp. Form.C27H29N7O
Mol. Mass.467.5655
SMILESCc1c[nH]c2nc(Nc3ccc(cc3)N3CCN(CCO)CC3)nc(-c3cccc(CC#N)c3)c12