Reaction Details
TargetAurora kinase A
LigandBDBM50382425
Substrate/Competitorn/a
Meas. Tech.ChEMBL_815592 (CHEMBL2025258)
IC50 3±n/a nM
Citation Mollard, AWarner, SLCall, LTWade, MLBearss, JJVerma, ASharma, SVankayalapati, HBearss, DJ Design, Synthesis and Biological Evaluation of a Series of Novel Axl Kinase Inhibitors. ACS Med Chem Lett2:907-912 (2011) 
 
Aurora kinase A
Name:Aurora kinase A
Type:Serine/threonine-protein kinase
Mol. Mass.:45830.98
Organism:Homo sapiens (Human)
Description:O14965
Residue:403
BDBM50382425
NameBDBM50382425
Synonyms:CHEMBL2022968
TypeSmall organic molecule
Emp. Form.C24H30ClN7O2S
Mol. Mass.516.059
SMILESCN(C)S(=O)(=O)c1ccccc1Nc1nc(Nc2ccc(CN3CCN(C)CC3)cc2)ncc1Cl