Reaction Details
TargetAdenosine receptor A2b
LigandBDBM50382493
Substrate/Competitorn/a
Meas. Tech.ChEMBL_816304 (CHEMBL2026980)
Ki 158.49±n/a nM
Citation Congreve, MAndrews, SPDoré, ASHollenstein, KHurrell, ELangmead, CJMason, JSNg, IWTehan, BZhukov, AWeir, MMarshall, FH Discovery of 1,2,4-triazine derivatives as adenosine A(2A) antagonists using structure based drug design. J Med Chem55:1898-903 (2012) 
 
Adenosine receptor A2b
Name:Adenosine receptor A2b
Type:G Protein-Coupled Receptor (GPCR)
Mol. Mass.:36341.22
Organism:Homo sapiens (Human)
Description:n/a
Residue:332
BDBM50382493
NameBDBM50382493
Synonyms:CHEMBL2024116
TypeSmall organic molecule
Emp. Form.C16H14FN5
Mol. Mass.295.3143
SMILESCc1cc(cc(C)n1)-c1nnc(N)nc1-c1ccc(F)cc1