Reaction Details
TargetAminopeptidase N
LigandBDBM50382508
Substrate/Competitorn/a
Meas. Tech.ChEMBL_816306 (CHEMBL2026982)
IC50 500±n/a nM
Citation Rosa, MArsequell, GRougeot, CCalle, LPMarcelo, FPinto, MCenteno, NBJiménez-Barbero, JValencia, G Structure-activity relationship study of opiorphin, a human dual ectopeptidase inhibitor with antinociceptive properties. J Med Chem55:1181-8 (2012) 
 
Aminopeptidase N
Name:Aminopeptidase N
Type:PROTEIN
Mol. Mass.:109522.63
Organism:Homo sapiens (Human)
Description:ChEMBL_1507526
Residue:967
BDBM50382508
NameBDBM50382508
Synonyms:CHEMBL2022234
TypeSmall organic molecule
Emp. Form.C29H47FN12O8
Mol. Mass.710.7575
SMILES[#7]-[#6@@H](-[#6]-[#6]-[#6](-[#7])=O)-[#6](=O)-[#7]-[#6@@H](-[#6]-[#6]-[#6]\[#7]=[#6](/[#7])-[#7])-[#6](=O)-[#7]-[#6@H](-[#6]-c1ccc(F)cc1)-[#6](=O)-[#7]-[#6@@H](-[#6]-[#8])-[#6](=O)-[#7]-[#6@@H](-[#6]-[#6]-[#6]\[#7]=[#6](/[#7])-[#7])-[#6](-[#8])=O