Reaction Details
TargetKinesin-like protein KIF11
LigandBDBM50382549
Substrate/Competitorn/a
Meas. Tech.ChEMBL_816345 (CHEMBL2024743)
Ki 149.8±n/a nM
Citation Wang, FGood, JARath, OKaan, HYSutcliffe, OBMackay, SPKozielski, F Triphenylbutanamines: kinesin spindle protein inhibitors with in vivo antitumor activity. J Med Chem55:1511-25 (2012) 
 
Kinesin-like protein KIF11
Name:Kinesin-like protein KIF11
Type:PROTEIN
Mol. Mass.:119138.97
Organism:Homo sapiens (Human)
Description:ChEMBL_1457426
Residue:1056
BDBM50382549
NameBDBM50382549
Synonyms:CHEMBL2022986
TypeSmall organic molecule
Emp. Form.C22H23NOS
Mol. Mass.349.489
SMILESCOc1cccc(c1)C(SCCN)(c1ccccc1)c1ccccc1