Reaction Details
TargetPotassium voltage-gated channel subfamily H member 2
LigandBDBM50382559
Substrate/Competitorn/a
Meas. Tech.ChEMBL_816515 (CHEMBL2025095)
IC50 4810±n/a nM
Citation Wang, FGood, JARath, OKaan, HYSutcliffe, OBMackay, SPKozielski, F Triphenylbutanamines: kinesin spindle protein inhibitors with in vivo antitumor activity. J Med Chem55:1511-25 (2012) 
 
Potassium voltage-gated channel subfamily H member 2
Name:Potassium voltage-gated channel subfamily H member 2
Type:Multi-pass membrane protein
Mol. Mass.:126672.65
Organism:Homo sapiens (Human)
Description:Q12809
Residue:1159
BDBM50382559
NameBDBM50382559
Synonyms:ISPINESIB
TypeSmall organic molecule
Emp. Form.C30H33ClN4O2
Mol. Mass.517.062
SMILESCC(C)[C@@H](N(CCCN)C(=O)c1ccc(C)cc1)c1nc2cc(Cl)ccc2c(=O)n1Cc1ccccc1