Reaction Details
TargetCytochrome P450 2C9
LigandBDBM50382558
Substrate/Competitorn/a
Meas. Tech.ChEMBL_816518 (CHEMBL2025098)
IC50 4300±n/a nM
Citation Wang, FGood, JARath, OKaan, HYSutcliffe, OBMackay, SPKozielski, F Triphenylbutanamines: kinesin spindle protein inhibitors with in vivo antitumor activity. J Med Chem55:1511-25 (2012) 
 
Cytochrome P450 2C9
Name:Cytochrome P450 2C9
Type:Enzyme
Mol. Mass.:55636.33
Organism:Homo sapiens (Human)
Description:P11712
Residue:490
BDBM50382558
NameBDBM50382558
Synonyms:CHEMBL2022997
TypeSmall organic molecule
Emp. Form.C23H25N
Mol. Mass.315.4513
SMILESCc1cccc(c1)C(CCCN)(c1ccccc1)c1ccccc1