Reaction Details
TargetCytochrome P450 2C19
LigandBDBM50382546
Substrate/Competitorn/a
Meas. Tech.ChEMBL_816519 (CHEMBL2025099)
IC50>25000±n/a nM
Citation Wang, FGood, JARath, OKaan, HYSutcliffe, OBMackay, SPKozielski, F Triphenylbutanamines: kinesin spindle protein inhibitors with in vivo antitumor activity. J Med Chem55:1511-25 (2012) 
 
Cytochrome P450 2C19
Name:Cytochrome P450 2C19
Type:Enzyme
Mol. Mass.:55935.47
Organism:Homo sapiens (Human)
Description:P33261
Residue:490
BDBM50382546
NameBDBM50382546
Synonyms:CHEMBL2022996
TypeSmall organic molecule
Emp. Form.C24H25NO2
Mol. Mass.359.4608
SMILESCc1cccc(c1)C(CC[C@@H](N)C(O)=O)(c1ccccc1)c1ccccc1