Reaction Details
TargetKinesin-like protein KIF11
LigandBDBM50382569
Substrate/Competitorn/a
Meas. Tech.ChEMBL_816345 (CHEMBL2024743)
Ki 329.9±n/a nM
Citation Wang, FGood, JARath, OKaan, HYSutcliffe, OBMackay, SPKozielski, F Triphenylbutanamines: kinesin spindle protein inhibitors with in vivo antitumor activity. J Med Chem55:1511-25 (2012) 
 
Kinesin-like protein KIF11
Name:Kinesin-like protein KIF11
Type:PROTEIN
Mol. Mass.:119138.97
Organism:Homo sapiens (Human)
Description:ChEMBL_1457426
Residue:1056
BDBM50382569
NameBDBM50382569
Synonyms:CHEMBL2024124
TypeSmall organic molecule
Emp. Form.C23H22N2O3S
Mol. Mass.406.497
SMILESN[C@@H](CSC(c1ccccc1)(c1ccccc1)c1cccc(c1)C(N)=O)C(O)=O