Reaction Details
TargetKinesin-like protein KIF11
LigandBDBM23802
Substrate/Competitorn/a
Meas. Tech.ChEMBL_816346 (CHEMBL2024744)
Ki 152.3±n/a nM
Citation Wang, FGood, JARath, OKaan, HYSutcliffe, OBMackay, SPKozielski, F Triphenylbutanamines: kinesin spindle protein inhibitors with in vivo antitumor activity. J Med Chem55:1511-25 (2012) 
 
Kinesin-like protein KIF11
Name:Kinesin-like protein KIF11
Type:PROTEIN
Mol. Mass.:119138.97
Organism:Homo sapiens (Human)
Description:ChEMBL_1457426
Residue:1056
BDBM23802
NameBDBM23802
Synonyms:2-[(triphenylmethyl)sulfanyl]ethan-1-amine | Triphenylmethyl-containing compound, 31
TypeSmall organic molecule
Emp. Form.C21H21NS
Mol. Mass.319.463
SMILESNCCSC(c1ccccc1)(c1ccccc1)c1ccccc1