Reaction Details
TargetKinesin-like protein KIF11
LigandBDBM23822
Substrate/Competitorn/a
Meas. Tech.ChEMBL_816346 (CHEMBL2024744)
Ki 13.6±n/a nM
Citation Wang, FGood, JARath, OKaan, HYSutcliffe, OBMackay, SPKozielski, F Triphenylbutanamines: kinesin spindle protein inhibitors with in vivo antitumor activity. J Med Chem55:1511-25 (2012) 
 
Kinesin-like protein KIF11
Name:Kinesin-like protein KIF11
Type:PROTEIN
Mol. Mass.:119138.97
Organism:Homo sapiens (Human)
Description:ChEMBL_1457426
Residue:1056
BDBM23822
NameBDBM23822
Synonyms:(2R)-2-amino-3-{[(4-methylphenyl)diphenylmethyl]sulfanyl}propanoic acid | S-Trityl-L-Cysteine (STLC) Analogue, 51
TypeSmall organic molecule
Emp. Form.C23H23NO2S
Mol. Mass.377.499
SMILESCc1ccc(cc1)C(SC[C@H](N)C(O)=O)(c1ccccc1)c1ccccc1