Reaction Details
TargetKinesin-like protein KIF11
LigandBDBM23780
Substrate/Competitorn/a
Meas. Tech.ChEMBL_816346 (CHEMBL2024744)
Ki 4.2±n/a nM
Citation Wang, FGood, JARath, OKaan, HYSutcliffe, OBMackay, SPKozielski, F Triphenylbutanamines: kinesin spindle protein inhibitors with in vivo antitumor activity. J Med Chem55:1511-25 (2012) 
 
Kinesin-like protein KIF11
Name:Kinesin-like protein KIF11
Type:PROTEIN
Mol. Mass.:119138.97
Organism:Homo sapiens (Human)
Description:ChEMBL_1457426
Residue:1056
BDBM23780
NameBDBM23780
Synonyms:(2R)-2-amino-3-[(naphthalen-2-yldiphenylmethyl)sulfanyl]propanoic acid | S-Trityl-L-Cysteine (STLC) Analogue, 9
TypeSmall organic molecule
Emp. Form.C26H23NO2S
Mol. Mass.413.531
SMILESN[C@@H](CSC(c1ccccc1)(c1ccccc1)c1ccc2ccccc2c1)C(O)=O