Reaction Details
Target5-hydroxytryptamine receptor 2A
LigandBDBM22871
Substrate/Competitorn/a
Meas. Tech.ChEMBL_816922 (CHEMBL2026265)
Ki 2.42±n/a nM
Citation Liégeois, JFDeville, MDilly, SLamy, CMangin, FRésimont, MTarazi, FI New pyridobenzoxazepine derivatives derived from 5-(4-methylpiperazin-1-yl)-8-chloro-pyrido[2,3-b][1,5]benzoxazepine (JL13): chemical synthesis and pharmacological evaluation. J Med Chem55:1572-82 (2012) 
 
5-hydroxytryptamine receptor 2A
Name:5-hydroxytryptamine receptor 2A
Type:undefined
Mol. Mass.:52607.65
Organism:Homo sapiens (Human)
Description:P28223
Residue:471
BDBM22871
NameBDBM22871
Synonyms:13-chloro-10-(4-methylpiperazin-1-yl)-2-oxa-9-azatricyclo[9.4.0.0^{3,8}]pentadeca-1(11),3,5,7,9,12,14-heptaene 8-chloro-6-(4-methylpiperazino)benzo[b][1,4]benzoxazepine;succinic acid CL71,563 Loxapine
TypeSmall organic molecule
Emp. Form.C18H18ClN3O
Mol. Mass.327.808
SMILESCN1CCN(CC1)C1=Nc2ccccc2Oc2ccc(Cl)cc12