Reaction Details
TargetRho-associated protein kinase 1
LigandBDBM50382691
Substrate/Competitorn/a
Meas. Tech.ChEMBL_817305 (CHEMBL2025930)
IC50 2900±n/a nM
Citation Li, RMartin, MPLiu, YWang, BPatel, RAZhu, JYSun, NPireddu, RLawrence, NJLi, JHaura, EBSung, SSGuida, WCSchonbrunn, ESebti, SM Fragment-based and structure-guided discovery and optimization of Rho kinase inhibitors. J Med Chem55:2474-8 (2012) 
 
Rho-associated protein kinase 1
Name:Rho-associated protein kinase 1
Type:Serine/threonine-protein kinase
Mol. Mass.:158156.77
Organism:Homo sapiens (Human)
Description:Q13464
Residue:1354
BDBM50382691
NameBDBM50382691
Synonyms:CHEMBL2023151 | US9409868, 15
TypeSmall organic molecule
Emp. Form.C16H16N4O2
Mol. Mass.296.3238
SMILESOC(CNC(=O)Nc1ccc2[nH]ncc2c1)c1ccccc1