Reaction Details
TargetRho-associated protein kinase 2
LigandBDBM50382695
Substrate/Competitorn/a
Meas. Tech.ChEMBL_817306 (CHEMBL2025931)
IC50 7520±n/a nM
Citation Li, RMartin, MPLiu, YWang, BPatel, RAZhu, JYSun, NPireddu, RLawrence, NJLi, JHaura, EBSung, SSGuida, WCSchonbrunn, ESebti, SM Fragment-based and structure-guided discovery and optimization of Rho kinase inhibitors. J Med Chem55:2474-8 (2012) 
 
Rho-associated protein kinase 2
Name:Rho-associated protein kinase 2
Type:Protein
Mol. Mass.:160885.43
Organism:Homo sapiens (Human)
Description:O75116
Residue:1388
BDBM50382695
NameBDBM50382695
Synonyms:CHEMBL2023157 | US9409868, 23
TypeSmall organic molecule
Emp. Form.C20H19N3O2
Mol. Mass.333.3838
SMILESOC[C@H](NC(=O)Nc1ccc(cc1)-c1ccncc1)c1ccccc1