Reaction Details
TargetRho-associated protein kinase 1
LigandBDBM50196697
Substrate/Competitorn/a
Meas. Tech.ChEMBL_817305 (CHEMBL2025930)
IC50 13900±n/a nM
Citation Li, RMartin, MPLiu, YWang, BPatel, RAZhu, JYSun, NPireddu, RLawrence, NJLi, JHaura, EBSung, SSGuida, WCSchonbrunn, ESebti, SM Fragment-based and structure-guided discovery and optimization of Rho kinase inhibitors. J Med Chem55:2474-8 (2012) 
 
Rho-associated protein kinase 1
Name:Rho-associated protein kinase 1
Type:Serine/threonine-protein kinase
Mol. Mass.:158156.77
Organism:Homo sapiens (Human)
Description:Q13464
Residue:1354
BDBM50196697
NameBDBM50196697
Synonyms:1-benzyl-3-(1H-indazol-5-yl)urea N-benzyl-N0-(1H-5-indazolyl)urea | US9409868, 12
TypeSmall organic molecule
Emp. Form.C15H14N4O
Mol. Mass.266.2979
SMILESO=C(NCc1ccccc1)Nc1ccc2[nH]ncc2c1