Reaction Details
TargetRho-associated protein kinase 2
LigandBDBM50279877
Substrate/Competitorn/a
Meas. Tech.ChEMBL_817306 (CHEMBL2025931)
IC50 55900±n/a nM
Citation Li, RMartin, MPLiu, YWang, BPatel, RAZhu, JYSun, NPireddu, RLawrence, NJLi, JHaura, EBSung, SSGuida, WCSchonbrunn, ESebti, SM Fragment-based and structure-guided discovery and optimization of Rho kinase inhibitors. J Med Chem55:2474-8 (2012) 
 
Rho-associated protein kinase 2
Name:Rho-associated protein kinase 2
Type:Protein
Mol. Mass.:160885.43
Organism:Homo sapiens (Human)
Description:O75116
Residue:1388
BDBM50279877
NameBDBM50279877
Synonyms:CHEMBL67352 US9409868, 3
TypeSmall organic molecule
Emp. Form.C11H9N3O
Mol. Mass.199.2087
SMILESO=C(Nc1ccncc1)c1cccnc1