Reaction Details
TargetRho-associated protein kinase 1
LigandBDBM50382699
Substrate/Competitorn/a
Meas. Tech.ChEMBL_817305 (CHEMBL2025930)
IC50 72500±n/a nM
Citation Li, RMartin, MPLiu, YWang, BPatel, RAZhu, JYSun, NPireddu, RLawrence, NJLi, JHaura, EBSung, SSGuida, WCSchonbrunn, ESebti, SM Fragment-based and structure-guided discovery and optimization of Rho kinase inhibitors. J Med Chem55:2474-8 (2012) 
 
Rho-associated protein kinase 1
Name:Rho-associated protein kinase 1
Type:Serine/threonine-protein kinase
Mol. Mass.:158156.77
Organism:Homo sapiens (Human)
Description:Q13464
Residue:1354
BDBM50382699
NameBDBM50382699
Synonyms:CHEMBL2022282 | US9409868, 4
TypeSmall organic molecule
Emp. Form.C11H8ClN3O
Mol. Mass.233.654
SMILESClc1ccncc1C(=O)Nc1ccncc1