Reaction Details
TargetRho-associated protein kinase 1
LigandBDBM50382698
Substrate/Competitorn/a
Meas. Tech.ChEMBL_817305 (CHEMBL2025930)
IC50 157100±n/a nM
Citation Li, RMartin, MPLiu, YWang, BPatel, RAZhu, JYSun, NPireddu, RLawrence, NJLi, JHaura, EBSung, SSGuida, WCSchonbrunn, ESebti, SM Fragment-based and structure-guided discovery and optimization of Rho kinase inhibitors. J Med Chem55:2474-8 (2012) 
 
Rho-associated protein kinase 1
Name:Rho-associated protein kinase 1
Type:Serine/threonine-protein kinase
Mol. Mass.:158156.77
Organism:Homo sapiens (Human)
Description:Q13464
Residue:1354
BDBM50382698
NameBDBM50382698
Synonyms:CHEMBL2023148 | US9409868, 11
TypeSmall organic molecule
Emp. Form.C14H12N4O
Mol. Mass.252.2713
SMILESO=C(Nc1ccccc1)Nc1ccc2[nH]ncc2c1