Reaction Details
TargetRho-associated protein kinase 2
LigandBDBM50382700
Substrate/Competitorn/a
Meas. Tech.ChEMBL_817306 (CHEMBL2025931)
IC50 357200±n/a nM
Citation Li, RMartin, MPLiu, YWang, BPatel, RAZhu, JYSun, NPireddu, RLawrence, NJLi, JHaura, EBSung, SSGuida, WCSchonbrunn, ESebti, SM Fragment-based and structure-guided discovery and optimization of Rho kinase inhibitors. J Med Chem55:2474-8 (2012) 
 
Rho-associated protein kinase 2
Name:Rho-associated protein kinase 2
Type:Protein
Mol. Mass.:160885.43
Organism:Homo sapiens (Human)
Description:O75116
Residue:1388
BDBM50382700
NameBDBM50382700
Synonyms:CHEMBL1566648 | US9409868, 5
TypeSmall organic molecule
Emp. Form.C11H8BrN3O
Mol. Mass.278.105
SMILESBrc1cncc(c1)C(=O)Nc1ccncc1