Reaction Details
TargetRho-associated protein kinase 1
LigandBDBM50382702
Substrate/Competitorn/a
Meas. Tech.ChEMBL_817305 (CHEMBL2025930)
IC50>400000±n/a nM
Citation Li, RMartin, MPLiu, YWang, BPatel, RAZhu, JYSun, NPireddu, RLawrence, NJLi, JHaura, EBSung, SSGuida, WCSchonbrunn, ESebti, SM Fragment-based and structure-guided discovery and optimization of Rho kinase inhibitors. J Med Chem55:2474-8 (2012) 
 
Rho-associated protein kinase 1
Name:Rho-associated protein kinase 1
Type:Serine/threonine-protein kinase
Mol. Mass.:158156.77
Organism:Homo sapiens (Human)
Description:Q13464
Residue:1354
BDBM50382702
NameBDBM50382702
Synonyms:CHEMBL2023145 | US9409868, 7
TypeSmall organic molecule
Emp. Form.C17H12FN3O
Mol. Mass.293.2951
SMILESFc1ccc(cc1)-c1cncc(c1)C(=O)Nc1ccncc1