Reaction Details
TargetCarbonic anhydrase 2
LigandBDBM50382706
Substrate/Competitorn/a
Meas. Tech.ChEMBL_817438 (CHEMBL2027661)
Ki 0.70±n/a nM
Citation Carta, FAggarwal, MMaresca, AScozzafava, AMcKenna, RMasini, ESupuran, CT Dithiocarbamates strongly inhibit carbonic anhydrases and show antiglaucoma action in vivo. J Med Chem55:1721-30 (2012) 
 
Carbonic anhydrase 2
Name:Carbonic anhydrase 2
Type:Enzyme
Mol. Mass.:29250.71
Organism:Homo sapiens (Human)
Description:P00918
Residue:260
BDBM50382706
NameBDBM50382706
Synonyms:Benzyldithiocarbamate sodium salt (I) | CHEMBL2023168
TypeSmall organic molecule
Emp. Form.C8H8NS2
Mol. Mass.182.286
SMILES[S-]C(=S)NCc1ccccc1