Reaction Details
TargetCarbonic anhydrase 2
LigandBDBM50382722
Substrate/Competitorn/a
Meas. Tech.ChEMBL_817438 (CHEMBL2027661)
Ki 0.92±n/a nM
Citation Carta, FAggarwal, MMaresca, AScozzafava, AMcKenna, RMasini, ESupuran, CT Dithiocarbamates strongly inhibit carbonic anhydrases and show antiglaucoma action in vivo. J Med Chem55:1721-30 (2012) 
 
Carbonic anhydrase 2
Name:Carbonic anhydrase 2
Type:Enzyme
Mol. Mass.:29250.71
Organism:Homo sapiens (Human)
Description:P00918
Residue:260
BDBM50382722
NameBDBM50382722
Synonyms:CHEMBL2023728
TypeSmall organic molecule
Emp. Form.C6H8N2S4
Mol. Mass.236.402
SMILES[S-]C(=S)N1CCN(CC1)C([S-])=S