Reaction Details
TargetCarbonic anhydrase 2
LigandBDBM50382723
Substrate/Competitorn/a
Meas. Tech.ChEMBL_817438 (CHEMBL2027661)
Ki 41±n/a nM
Citation Carta, FAggarwal, MMaresca, AScozzafava, AMcKenna, RMasini, ESupuran, CT Dithiocarbamates strongly inhibit carbonic anhydrases and show antiglaucoma action in vivo. J Med Chem55:1721-30 (2012) 
 
Carbonic anhydrase 2
Name:Carbonic anhydrase 2
Type:Enzyme
Mol. Mass.:29250.71
Organism:Homo sapiens (Human)
Description:P00918
Residue:260
BDBM50382723
NameBDBM50382723
Synonyms:CHEMBL2023729
TypeSmall organic molecule
Emp. Form.C13H13N2S2
Mol. Mass.261.386
SMILES[S-]C(=S)N1CCC(CC1)(C#N)c1ccccc1