Reaction Details
TargetCarbonic anhydrase 9
LigandBDBM50382706
Substrate/Competitorn/a
Meas. Tech.ChEMBL_817439 (CHEMBL2027662)
Ki 19±n/a nM
Citation Carta, FAggarwal, MMaresca, AScozzafava, AMcKenna, RMasini, ESupuran, CT Dithiocarbamates strongly inhibit carbonic anhydrases and show antiglaucoma action in vivo. J Med Chem55:1721-30 (2012) 
 
Carbonic anhydrase 9
Name:Carbonic anhydrase 9
Type:Enzyme
Mol. Mass.:49669.03
Organism:Homo sapiens (Human)
Description:Catalytic domain of human cloned isozyme was used in the assay
Residue:459
BDBM50382706
NameBDBM50382706
Synonyms:Benzyldithiocarbamate sodium salt (I) | CHEMBL2023168
TypeSmall organic molecule
Emp. Form.C8H8NS2
Mol. Mass.182.286
SMILES[S-]C(=S)NCc1ccccc1