Reaction Details
TargetCarbonic anhydrase 9
LigandBDBM50382707
Substrate/Competitorn/a
Meas. Tech.ChEMBL_817439 (CHEMBL2027662)
Ki 26±n/a nM
Citation Carta, FAggarwal, MMaresca, AScozzafava, AMcKenna, RMasini, ESupuran, CT Dithiocarbamates strongly inhibit carbonic anhydrases and show antiglaucoma action in vivo. J Med Chem55:1721-30 (2012) 
 
Carbonic anhydrase 9
Name:Carbonic anhydrase 9
Type:Enzyme
Mol. Mass.:49669.03
Organism:Homo sapiens (Human)
Description:Catalytic domain of human cloned isozyme was used in the assay
Residue:459
BDBM50382707
NameBDBM50382707
Synonyms:CHEMBL2023169
TypeSmall organic molecule
Emp. Form.C7H8N2S2
Mol. Mass.184.282
SMILESSC(=S)NCc1ccncc1