Reaction Details
TargetCarbonic anhydrase 9
LigandBDBM50382713
Substrate/Competitorn/a
Meas. Tech.ChEMBL_817439 (CHEMBL2027662)
Ki 70±n/a nM
Citation Carta, FAggarwal, MMaresca, AScozzafava, AMcKenna, RMasini, ESupuran, CT Dithiocarbamates strongly inhibit carbonic anhydrases and show antiglaucoma action in vivo. J Med Chem55:1721-30 (2012) 
 
Carbonic anhydrase 9
Name:Carbonic anhydrase 9
Type:Enzyme
Mol. Mass.:49669.03
Organism:Homo sapiens (Human)
Description:Catalytic domain of human cloned isozyme was used in the assay
Residue:459
BDBM50382713
NameBDBM50382713
Synonyms:CHEMBL2021946
TypeSmall organic molecule
Emp. Form.C5H8NS2
Mol. Mass.146.254
SMILES[S-]C(=S)N1CCCC1