Reaction Details
TargetCarbonic anhydrase 12
LigandBDBM50010231
Substrate/Competitorn/a
Meas. Tech.ChEMBL_817440 (CHEMBL2027663)
Ki 1105±n/a nM
Citation Carta, FAggarwal, MMaresca, AScozzafava, AMcKenna, RMasini, ESupuran, CT Dithiocarbamates strongly inhibit carbonic anhydrases and show antiglaucoma action in vivo. J Med Chem55:1721-30 (2012) 
 
Carbonic anhydrase 12
Name:Carbonic anhydrase 12
Type:Enzyme
Mol. Mass.:39456.00
Organism:Homo sapiens (Human)
Description:Catalytic domain of human cloned isozyme was used in the assay
Residue:354
BDBM50010231
NameBDBM50010231
Synonyms:CHEMBL107217 Sodium salt of Diethyl-dithiocarbamic acid(DDC) sodium N,N-diethyl-dithiocarbamate | sodium diethyldithiocarbamate
TypeSmall organic molecule
Emp. Form.C5H10NS2
Mol. Mass.148.27
SMILESCCN(CC)C([S-])=S