Reaction Details
TargetCarbonic anhydrase 12
LigandBDBM50382717
Substrate/Competitorn/a
Meas. Tech.ChEMBL_817440 (CHEMBL2027663)
Ki 16±n/a nM
Citation Carta, FAggarwal, MMaresca, AScozzafava, AMcKenna, RMasini, ESupuran, CT Dithiocarbamates strongly inhibit carbonic anhydrases and show antiglaucoma action in vivo. J Med Chem55:1721-30 (2012) 
 
Carbonic anhydrase 12
Name:Carbonic anhydrase 12
Type:Enzyme
Mol. Mass.:39456.00
Organism:Homo sapiens (Human)
Description:Catalytic domain of human cloned isozyme was used in the assay
Residue:354
BDBM50382717
NameBDBM50382717
Synonyms:CHEMBL2023722
TypeSmall organic molecule
Emp. Form.C13H26NS2
Mol. Mass.260.483
SMILESCCCCCCN(CCCCCC)C([S-])=S