Reaction Details
TargetCarbonic anhydrase 1
LigandBDBM50382728
Substrate/Competitorn/a
Meas. Tech.ChEMBL_817309 (CHEMBL2025934)
Ki 0.88±n/a nM
Citation Carta, FAggarwal, MMaresca, AScozzafava, AMcKenna, RMasini, ESupuran, CT Dithiocarbamates strongly inhibit carbonic anhydrases and show antiglaucoma action in vivo. J Med Chem55:1721-30 (2012) 
 
Carbonic anhydrase 1
Name:Carbonic anhydrase 1
Type:Enzyme
Mol. Mass.:28873.37
Organism:Homo sapiens (Human)
Description:P00915
Residue:261
BDBM50382728
NameBDBM50382728
Synonyms:CHEMBL2023727
TypeSmall organic molecule
Emp. Form.C5H8NOS2
Mol. Mass.162.254
SMILES[S-]C(=S)N1CCOCC1